Target
Eukaryotic translation initiation factor 4E-binding protein 1
Ligand
BDBM544984
Substrate
Meas. Tech.
Fluorescence Polarization Assay
IC50
2.25±n/a nM
Citation
 Sperry, SXiang, AXErnst, JTReich, SHSprengeler, PAShaghafi, MMichels, TNilewski, CTran, CVPackard, GKGrubbs, AUrkalan, KMukaiyama, T EIF4E-inhibiting compounds and methods US Patent  US11286268 Publication Date 3/29/2022 
Target
Name:
Eukaryotic translation initiation factor 4E-binding protein 1
Synonyms:
4EBP1_HUMAN GFP-4EBP Green fluorescent protein-Eukaryotic initiation factor 4E (eIF4E) binding protein
Type:
Fusion protein
Mol. Mass.:
12578.35
Organism:
Homo sapiens (Human)
Description:
Residue:
118
  
Inhibitor
Name:
BDBM544984
Synonyms:
US11286268, Compound 469
Type:
Small organic molecule
Emp. Form.:
C35H25ClF3N5O4S
Mol. Mass.:
704.117
SMILES:
Cc1cc(c(C)cn1)-c1c(cc2nc(C)n(CCOc3ccc(Cl)cc3-c3cc(C)nc4c(csc34)C(O)=O)c(=O)c2c1C#N)C(F)(F)F
: