Target
Eukaryotic translation initiation factor 4E-binding protein 1
Ligand
BDBM545105
Substrate
Meas. Tech.
Fluorescence Polarization Assay
IC50
2.26±n/a nM
Citation
 Sperry, SXiang, AXErnst, JTReich, SHSprengeler, PAShaghafi, MMichels, TNilewski, CTran, CVPackard, GKGrubbs, AUrkalan, KMukaiyama, T EIF4E-inhibiting compounds and methods US Patent  US11286268 Publication Date 3/29/2022 
Target
Name:
Eukaryotic translation initiation factor 4E-binding protein 1
Synonyms:
4EBP1_HUMAN GFP-4EBP Green fluorescent protein-Eukaryotic initiation factor 4E (eIF4E) binding protein
Type:
Fusion protein
Mol. Mass.:
12578.35
Organism:
Homo sapiens (Human)
Description:
Residue:
118
  
Inhibitor
Name:
BDBM545105
Synonyms:
US11286268, Compound 590
Type:
Small organic molecule
Emp. Form.:
C28H20ClF3N4O5S
Mol. Mass.:
616.995
SMILES:
CC1C=C(c2scc(C(O)=O)c2N1=O)c1cc(Cl)ccc1OCCn1c(C)nc2cc(cc(C#N)c2c1=O)C(F)(F)F
: