Target
Eukaryotic translation initiation factor 4E-binding protein 1
Ligand
BDBM545733
Substrate
Meas. Tech.
Fluorescence Polarization Assay
IC50
2.79±n/a nM
Citation
 Sperry, SXiang, AXErnst, JTReich, SHSprengeler, PAShaghafi, MMichels, TNilewski, CTran, CVPackard, GKGrubbs, AUrkalan, KMukaiyama, T EIF4E-inhibiting compounds and methods US Patent  US11286268 Publication Date 3/29/2022 
Target
Name:
Eukaryotic translation initiation factor 4E-binding protein 1
Synonyms:
4EBP1_HUMAN GFP-4EBP Green fluorescent protein-Eukaryotic initiation factor 4E (eIF4E) binding protein
Type:
Fusion protein
Mol. Mass.:
12578.35
Organism:
Homo sapiens (Human)
Description:
Residue:
118
  
Inhibitor
Name:
BDBM545733
Synonyms:
US11286268, Compound 1223
Type:
Small organic molecule
Emp. Form.:
C32H30ClF3N6O4
Mol. Mass.:
655.067
SMILES:
CCc1cc(cc(n1)C(O)=O)-c1cc(Cl)ccc1OCCn1c(C)nc2cc(c(N3CCN(C)CC3)c(C#N)c2c1=O)C(F)(F)F
: