Target
Monocarboxylate transporter 4
Ligand
BDBM356790
Substrate
Meas. Tech.
Biological Activity Assay 3
IC50
0.320±n/a nM
Citation
 Parnell, KMMcCall, JRomero, D Heterocyclic inhibitors of MCT4 US Patent  US11292767 Publication Date 4/5/2022 
Target
Name:
Monocarboxylate transporter 4
Synonyms:
MCT 4 MCT4 SLC16A3 | Solute carrier family 16 member 3
Type:
PROTEIN
Mol. Mass.:
49474.36
Organism:
Homo sapiens (Human)
Description:
ChEMBL_104604
Residue:
465
  
Inhibitor
Name:
BDBM356790
Synonyms:
US10214492, Example 155 | US11292767, Example 155
Type:
Small organic molecule
Emp. Form.:
C28H35N3O4
Mol. Mass.:
477.5952
SMILES:
CC(C)(C)COc1cccc(c1)-c1cc(COC(C)(C)C(O)=O)nn1-c1ccccc1N1CCC1
: