Target
Monocarboxylate transporter 4
Ligand
BDBM356805
Substrate
Meas. Tech.
Biological Activity Assay 3
IC50
0.590±n/a nM
Citation
 Parnell, KMMcCall, JRomero, D Heterocyclic inhibitors of MCT4 US Patent  US11292767 Publication Date 4/5/2022 
Target
Name:
Monocarboxylate transporter 4
Synonyms:
MCT 4 MCT4 SLC16A3 | Solute carrier family 16 member 3
Type:
PROTEIN
Mol. Mass.:
49474.36
Organism:
Homo sapiens (Human)
Description:
ChEMBL_104604
Residue:
465
  
Inhibitor
Name:
BDBM356805
Synonyms:
US10214492, Example 167 | US11292767, Example 167
Type:
Small organic molecule
Emp. Form.:
C27H32N4O4
Mol. Mass.:
476.5674
SMILES:
Cn1ncc2cccc(-n3nc(COC(C)(C)C(O)=O)cc3-c3cccc(OCC(C)(C)C)c3)c12
: