Target
Trace amine-associated receptor 1
Ligand
BDBM250298
Substrate
Meas. Tech.
Human TAAR1 assay
EC50
61.9±n/a nM
Citation
 Galley, GHoener, MNorcross, RPflieger, P Morpholine derivative US Patent  US11312711 Publication Date 4/26/2022 
Target
Name:
Trace amine-associated receptor 1
Synonyms:
TA1 TAAR1_HUMAN TRAR1 | trace amine-associated receptor 1
Type:
PROTEIN
Mol. Mass.:
39107.47
Organism:
Homo sapiens (Human)
Description:
ChEMBL_792734
Residue:
339
  
Inhibitor
Name:
BDBM250298
Synonyms:
US10501411, Example 208 US11697636, Example 208 | US9452980, 208
Type:
Small organic molecule
Emp. Form.:
C16H16ClN3O2
Mol. Mass.:
317.77
SMILES:
Clc1ccc(cn1)C(=O)Nc1ccc(cc1)[C@H]1CNCCO1
: