Target
Bcl-2-like protein 1
Ligand
BDBM552913
Substrate
Meas. Tech.
Binding Assay
Kd
55±n/a nM
Citation
 Pinchman, JRHuang, PQBunker, KDSit, RKSamatar, AA Benzamide compounds US Patent  US11318134 Publication Date 5/3/2022 
Target
Name:
Bcl-2-like protein 1
Synonyms:
Anti-apoptotic Bcl-2 protein Apoptosis regulator Bcl-X BCL2-like 1 isoform 1 BCL2L1 Bcl-2-like protein 1 (Bcl-XL) Bcl-xL/Bcl-2-binding component 3 Bcl2-antagonist of cell death (BAD)
Type:
Mitochondrion membrane; Single-pass membrane protein
Mol. Mass.:
26039.60
Organism:
Homo sapiens (Human)
Description:
Residue:
233
  
Inhibitor
Name:
BDBM552913
Synonyms:
2-((1H-pyrrolo[2,3-b]pyridin-5-yl)oxy)-4-(4-((4,4-dimethyl-2-(3-methylbicyclo[1.1.1]pentan-1-yl)cyclohex-1-en-1-yl)methyl)piperazin-1-yl)-N-((4-(((4-methylmorpholin-2-yl)methyl)amino)-3-nitrophenyl)sulfonyl)benzamide US11344546, Example 17 | US11590126, Example 17
Type:
Small organic molecule
Emp. Form.:
C45H56N8O7S
Mol. Mass.:
853.041
SMILES:
CN1CCOC(CNc2ccc(cc2[N+]([O-])=O)S(=O)(=O)NC(=O)c2ccc(cc2Oc2cnc3[nH]ccc3c2)N2CCN(CC3=C(CC(C)(C)CC3)C34CC(C)(C3)C4)CC2)C1
: