Target
Bcl-2-like protein 1
Ligand
BDBM552922
Substrate
Meas. Tech.
Binding Assay
Kd
>100±n/a nM
Citation
 Pinchman, JRHuang, PQBunker, KDSit, RKSamatar, AA Benzamide compounds US Patent  US11318134 Publication Date 5/3/2022 
Target
Name:
Bcl-2-like protein 1
Synonyms:
Anti-apoptotic Bcl-2 protein Apoptosis regulator Bcl-X BCL2-like 1 isoform 1 BCL2L1 Bcl-2-like protein 1 (Bcl-XL) Bcl-xL/Bcl-2-binding component 3 Bcl2-antagonist of cell death (BAD)
Type:
Mitochondrion membrane; Single-pass membrane protein
Mol. Mass.:
26039.60
Organism:
Homo sapiens (Human)
Description:
Residue:
233
  
Inhibitor
Name:
BDBM552922
Synonyms:
2-((1H-pyrrolo[2,3-b]pyridin-5-yl)oxy)-4-(4-((4,4-dimethyl-2-(3-(trifluoromethyl)bicyclo[1.1.1]pentan-1-yl)cyclohex-1-en-1-yl)methyl)piperazin-1-yl)-N-((4-((((1r,4r)-4-hydroxy-4-methylcyclohexyl)methyl)amino)-3-nitrophenyl)sulfonyl)benzamide US11590126, Example 32
Type:
Small organic molecule
Emp. Form.:
C47H56F3N7O7S
Mol. Mass.:
920.05
SMILES:
CC1(C)CCC(CN2CCN(CC2)c2ccc(C(=O)NS(=O)(=O)c3ccc(NC[C@H]4CC[C@](C)(O)CC4)c(c3)[N+]([O-])=O)c(Oc3cnc4[nH]ccc4c3)c2)=C(C1)C12CC(C1)(C2)C(F)(F)F
: