Target
Bcl-2-like protein 1
Ligand
BDBM60828
Substrate
Meas. Tech.
Binding Assay
Kd
55±n/a nM
Citation
 Pinchman, JRHuang, PQBunker, KDSit, RKSamatar, AA Benzamide compounds US Patent  US11318134 Publication Date 5/3/2022 
Target
Name:
Bcl-2-like protein 1
Synonyms:
Anti-apoptotic Bcl-2 protein Apoptosis regulator Bcl-X BCL2-like 1 isoform 1 BCL2L1 Bcl-2-like protein 1 (Bcl-XL) Bcl-xL/Bcl-2-binding component 3 Bcl2-antagonist of cell death (BAD)
Type:
Mitochondrion membrane; Single-pass membrane protein
Mol. Mass.:
26039.60
Organism:
Homo sapiens (Human)
Description:
Residue:
233
  
Inhibitor
Name:
BDBM60828
Synonyms:
ABT-199 US10213433, Compound 5 US11318134, Example ABT-199 US11590126, Example ABT-199 US20240043404, Example 369 | US9174982, 369
Type:
Emp. Form.:
C45H50ClN7O7S
Mol. Mass.:
868.439
SMILES:
CC1(C)CCC(CN2CCN(CC2)c2ccc(C(=O)NS(=O)(=O)c3ccc(NCC4CCOCC4)c(c3)[N+]([O-])=O)c(Oc3cnc4[nH]ccc4c3)c2)=C(C1)c1ccc(Cl)cc1
: