Target
Epidermal growth factor receptor [669-770,'SVD',771-1210]
Ligand
BDBM555116
Substrate
Meas. Tech.
Kinase Assay
IC50
<0.072±n/a nM
Citation
 Siegel, SSiegel, FSchulze, VBerger, MGraham, KKlar, UEis, KSülzle, DBömer, UKorr, DPetersen, KMönning, UEberspächer, UMoosmayer, DMeyerson, MGreulich, HKaplan, BHarb, HYDinh, PM 4H-pyrrolo[3,2-c]pyridin-4-one derivatives US Patent  US11339157 Publication Date 5/24/2022 
Target
Name:
Epidermal growth factor receptor [669-770,'SVD',771-1210]
Synonyms:
EGFR ERBB Epidermal growth factor receptor [669-769,''ASV'',770-1210] HER1
Type:
Enzyme Catalytic Domain
Mol. Mass.:
61473.15
Organism:
Homo sapiens (Human)
Description:
P00533[669-770,'SVD',771-1210]
Residue:
545
  
Inhibitor
Name:
BDBM555116
Synonyms:
3-[(3,5-difluorophenyl)amino]-2-[3-(2-methoxy-2-methylpropoxy)pyridin-4-yl]-1,5,6,7-tetrahydro-4H-pyrrolo[3,2-c]pyridin-4-one | US11339157, Example 10
Type:
Small organic molecule
Emp. Form.:
C23H24F2N4O3
Mol. Mass.:
442.4585
SMILES:
COC(C)(C)COc1cnccc1-c1[nH]c2CCNC(=O)c2c1Nc1cc(F)cc(F)c1
: