Target
POU domain, class 5, transcription factor 1
Ligand
BDBM306794
Substrate
Meas. Tech.
OCT3 inhibitory activity
IC50
25300±n/a nM
Citation
 Yamashita, HSuzuki, N OCT3 activity inhibitor containing imidazopyridine derivative as active component, and OCT3 detection agent US Patent  US10149840 Publication Date 12/11/2018 
Target
Name:
POU domain, class 5, transcription factor 1
Synonyms:
OCT3 OTF-3 Oct-3 Octamer-binding protein 3 Octamer-binding transcription factor 3 POU5F1
Type:
Enzyme Catalytic Domain
Mol. Mass.:
38567.64
Organism:
Homo sapiens (Human)
Description:
Q01860
Residue:
360
  
Inhibitor
Name:
BDBM306794
Synonyms:
US10149840, Compound SR-4229 | US10149840, Series Number 41
Type:
Small organic molecule
Emp. Form.:
C18H18N6OS
Mol. Mass.:
366.44
SMILES:
CCOc1ccccc1-n1nnnc1SCc1cn2cc(C)ccc2n1
: