Target
Cyclin-K/Cyclin-dependent kinase 12
Ligand
BDBM479064
Substrate
Meas. Tech.
Assay Condition A
IC50
<100±n/a nM
Citation
 Kanouni, TArnold, LDKaldor, SWMurphy, EATyhonas, J Inhibitors of cyclin-dependent kinases US Patent  US11390618 Publication Date 7/19/2022 
Target
Name:
Cyclin-K/Cyclin-dependent kinase 12
Synonyms:
CDK12/Cyclin K
Type:
Mol. Mass.:
Description:
ASSAY_ID of ChEMBL is 1735959
Components:
This complex has 2 components.
Component 1
Name:
Cyclin-K
Synonyms:
CCNK CPR4
Type:
PROTEIN
Mol. Mass.:
64254.10
Organism:
Homo sapiens (Human)
Description:
ChEMBL_107901
Residue:
580
  
Component 2
Name:
Cyclin-dependent kinase 12
Synonyms:
2.7.11.22 CDC2-related protein kinase 7 CDK12_HUMAN CRKRS Cell division cycle 2-related protein kinase 7 Cyclin-dependent kinase 12 hCDK12
Type:
PROTEIN
Mol. Mass.:
164218.64
Organism:
Homo sapiens
Description:
ChEMBL_117739
Residue:
1490
  
Inhibitor
Name:
BDBM479064
Synonyms:
(R)-N-(4-(3-((5-bromopyrimidin-2- yl)amino)pyrrolidine-1- carbonyl)phenyl)-N- methylacrylamide US11390618, Example 104
Type:
Small organic molecule
Emp. Form.:
C19H20BrN5O2
Mol. Mass.:
430.298
SMILES:
CN(C(=O)C=C)c1ccc(cc1)C(=O)N1CC[C@H](C1)Nc1ncc(Br)cn1
: