Target
Membrane primary amine oxidase
Ligand
BDBM561959
Substrate
Meas. Tech.
Biological Assay
IC50
0.220±n/a nM
Citation
 Gu, ZLi, JLi, ZWang, WQin, HWang, XLiu, JZhang, Y Amine compound for inhibiting SSAO/VAP-1 and use thereof US Patent  US11396495 Publication Date 7/26/2022 
Target
Name:
Membrane primary amine oxidase
Synonyms:
AOC3 Amine oxidase, copper containing Semicarbazide-sensitive amine oxidase/ Vascular adhesion protein 1 (SSAO/VAP-1) Vascular adhesion protein 1 (VAP-1)
Type:
Protein
Mol. Mass.:
84620.86
Organism:
Homo sapiens (Human)
Description:
Q16853
Residue:
763
  
Inhibitor
Name:
BDBM561959
Synonyms:
6-[(E)-2-(aminomethyl)-3-fluoro-allyloxy]-2-(tetrahydropyran-4-yl)-3,4-dihydroisoquinolin-1-one | US11396495, No. 16
Type:
Small organic molecule
Emp. Form.:
C18H23FN2O3
Mol. Mass.:
334.3852
SMILES:
NC\C(COc1ccc2C(=O)N(CCc2c1)C1CCOCC1)=C/F
: