Target
BDNF/NT-3 growth factors receptor
Ligand
BDBM164938
Substrate
Meas. Tech.
TrkB Activity
IC50
2.00±n/a nM
Citation
 Kane, Jr., JLMatthews, GMetz, MKothe, MLiu, JScholte, A Tropomyosin-related kinase (TRK) inhibitors US Patent  US11406644 Publication Date 8/9/2022 
Target
Name:
BDNF/NT-3 growth factors receptor
Synonyms:
GP145-TrkB NTRK2 Neurotrophic tyrosine kinase receptor type 2 Trk-B Tropomyosin-related kinase B Tyrosine kinase receptor B (Trk-B)
Type:
Enzyme
Mol. Mass.:
91996.87
Organism:
Homo sapiens (Human)
Description:
Q16620
Residue:
822
  
Inhibitor
Name:
BDBM164938
Synonyms:
US10166239, Ex. 3-37-6 US9067914, Ex. 3-37-6
Type:
Small organic molecule
Emp. Form.:
C26H24N6O3
Mol. Mass.:
468.5072
SMILES:
COc1ccc(COc2ccc(Cn3c(N)nc4cc(cnc34)-c3cccnc3)cc2OC)cn1
: