Target
Metabotropic glutamate receptor 7
Ligand
BDBM564989
Substrate
Meas. Tech.
In Vitro Pharmacology
IC50
<500±n/a nM
Citation
 Duvey, GCelanire, S Heterocyclic compounds as modulators of mGluR7 US Patent  US11414395 Publication Date 8/16/2022 
Target
Name:
Metabotropic glutamate receptor 7
Synonyms:
GPRC1G GRM7 protein MGLUR7 metabotropic glutamate 7
Type:
Enzyme Catalytic Domain
Mol. Mass.:
102262.98
Organism:
Homo sapiens (Human)
Description:
Q14831
Residue:
915
  
Inhibitor
Name:
BDBM564989
Synonyms:
US11414395, Example 37
Type:
Small organic molecule
Emp. Form.:
C23H24N4O
Mol. Mass.:
372.4629
SMILES:
Cc1ccc(C2CCc3c(C2)cnn(-c2nccc(n2)C2CC2)c3=O)c(C)c1
: