Target
Mitogen-activated protein kinase kinase kinase 5
Ligand
BDBM307616
Substrate
Meas. Tech.
ASK1 Kinase Assay
IC50
<200±n/a nM
Citation
 Brown, SD ASK1 inhibitor compounds and uses thereof US Patent  US10150755 Publication Date 12/11/2018 
Target
Name:
Mitogen-activated protein kinase kinase kinase 5
Synonyms:
ASK1 MAP3K5 MEKK5
Type:
Protein
Mol. Mass.:
154514.93
Organism:
Homo sapiens (Human)
Description:
Q99683
Residue:
1374
  
Inhibitor
Name:
BDBM307616
Synonyms:
N-cyclopropyl-2-(6- (4-cyclopropyl-4H- 1,2,4-triazol-3- yl)pyridin-2-yl)-1- oxoisoindoline-5- carboxamide | US10150755, Compound 8
Type:
Small organic molecule
Emp. Form.:
C22H20N6O2
Mol. Mass.:
400.4332
SMILES:
O=C(NC1CC1)c1ccc2C(=O)N(Cc2c1)c1cccc(n1)-c1nncn1C1CC1
: