Target
Tumor necrosis factor
Ligand
BDBM307619
Substrate
Meas. Tech.
Inhibition of LPS-induced TNFalpha in Human PBMCs
IC50
6000±n/a nM
Citation
 Brown, SD ASK1 inhibitor compounds and uses thereof US Patent  US10150755 Publication Date 12/11/2018 
Target
Name:
Tumor necrosis factor
Synonyms:
Cachectin TNF-a TNFA TNFSF2 Tumor necrosis factor (TNFa) Tumor necrosis factor ligand superfamily member 2 Tumor necrosis factor, soluble form | tumor necrosis factor alpha
Type:
Enzyme
Mol. Mass.:
25645.11
Organism:
Homo sapiens (Human)
Description:
P01375
Residue:
233
  
Inhibitor
Name:
BDBM307619
Synonyms:
2-(6-(4-cyclopropyl- 4H-1,2,4-triazol-3- yl)pyridin-2-yl)-5- (piperidine-1- carbonyl)isoindolin- 1-one | US10150755, Compound 11
Type:
Small organic molecule
Emp. Form.:
C24H24N6O2
Mol. Mass.:
428.4864
SMILES:
O=C(N1CCCCC1)c1ccc2C(=O)N(Cc2c1)c1cccc(n1)-c1nncn1C1CC1
: