Target
Myosin light chain kinase, smooth muscle
Ligand
BDBM307668
Substrate
Meas. Tech.
MYLK/MLCK Assay
Kd
<1000±n/a nM
Citation
 Brown, SD ASK1 inhibitor compounds and uses thereof US Patent  US10150755 Publication Date 12/11/2018 
Target
Name:
Myosin light chain kinase, smooth muscle
Synonyms:
KRP MLCK MYLK MYLK_HUMAN Telokin | smMLCK
Type:
Protein
Mol. Mass.:
210702.56
Organism:
Homo sapiens (Human)
Description:
Q15746
Residue:
1914
  
Inhibitor
Name:
BDBM307668
Synonyms:
2-(6-(4-cyclopropyl- 4H-1,2,4-triazol-3- yl)pyridin-2-yl)-6- (5- cyclopropylpyrazin- 2-yll)isoindolin-1- one | US10150755, Compound 60
Type:
Small organic molecule
Emp. Form.:
C25H21N7O
Mol. Mass.:
435.4805
SMILES:
O=C1N(Cc2ccc(cc12)-c1cnc(cn1)C1CC1)c1cccc(n1)-c1nncn1C1CC1
: