Target
Myosin light chain kinase, smooth muscle
Ligand
BDBM307686
Substrate
Meas. Tech.
MYLK/MLCK Assay
Kd
<1000±n/a nM
Citation
 Brown, SD ASK1 inhibitor compounds and uses thereof US Patent  US10150755 Publication Date 12/11/2018 
Target
Name:
Myosin light chain kinase, smooth muscle
Synonyms:
KRP MLCK MYLK MYLK_HUMAN Telokin | smMLCK
Type:
Protein
Mol. Mass.:
210702.56
Organism:
Homo sapiens (Human)
Description:
Q15746
Residue:
1914
  
Inhibitor
Name:
BDBM307686
Synonyms:
2-(6-(5-methyl-6,7-dihydro-5H-pyrrolo[2,1-c][1,2,4]triazol-3-yl)pyridin-2-yl)isoindolin-1-one | US10150755, Compound 78
Type:
Small organic molecule
Emp. Form.:
C19H17N5O
Mol. Mass.:
331.3712
SMILES:
CC1CCc2nnc(-c3cccc(n3)N3Cc4ccccc4C3=O)n12
: