Target
Enoyl-[acyl-carrier-protein] reductase [NADPH] FabI
Ligand
BDBM8716
Substrate
Crotonoyl-ACP
Meas. Tech.
Enzyme Inhibition Assay
pH
6.5±n/a
Temperature
303.15±n/a K
IC50
6700±500 nM
Citation
 Miller, WHSeefeld, MANewlander, KAUzinskas, INBurgess, WJHeerding, DAYuan, CCHead, MSPayne, DJRittenhouse, SFMoore, TDPearson, SCBerry, VDeWolf, WEKeller, PMPolizzi, BJQiu, XJanson, CAHuffman, WF Discovery of aminopyridine-based inhibitors of bacterial enoyl-ACP reductase (FabI). J Med Chem 45:3246-56 (2002)  
Target
Name:
Enoyl-[acyl-carrier-protein] reductase [NADPH] FabI
Synonyms:
Enoyl-ACP Reductase (FabI) FABI_STAAR fabI | trans-2-enoyl-[acyl carrier protein] reductase
Type:
Enzyme
Mol. Mass.:
27989.00
Organism:
Staphylococcus aureus
Description:
Q6GI75
Residue:
256
  
Inhibitor
Name:
BDBM8716
Synonyms:
3-[(N-Acetyl-N-methylamino)methyl]-4-amino-N-methyl-N-(1-methyl-1H-indol-2-ylmethyl)benzamide benzamide deriv. 5
Type:
Small organic molecule
Emp. Form.:
C22H26N4O2
Mol. Mass.:
378.4674
SMILES:
CN(Cc1cc2ccccc2n1C)C(=O)c1ccc(N)c(CN(C)C(C)=O)c1
:
Substrate
Name:
Crotonoyl-ACP
Synonyms:
Type:
Other Protein Type
Mol. Mass.:
358.43
Organism:
Description:
1. NAD(P)H is its co-substrate. 2. Crotonoyl-ACP was synthesized using ACP synthase to catalyse the addition of a crotonoyl group from crotonoyl-CoA to apo-ACP
Residue:
3
NA