Target
Vascular endothelial growth factor receptor 1
Ligand
BDBM107698
Substrate
Meas. Tech.
VEGF ELISA Assay
EC50
42100±n/a nM
Citation
 Kawamoto, RMWu, SEvdokimov, AGGreis, KDBoyer, ASWarshakoon, NC Prolyl hydroxylase inhibitors and methods of use US Patent  US11426393 Publication Date 8/30/2022 
Target
Name:
Vascular endothelial growth factor receptor 1
Synonyms:
FLT FRT Fms-like tyrosine kinase 1 Tyrosine-protein kinase FRT VEGFR-1 VGFR1_HUMAN Vascular endothelial growth factor receptor 1 (FLT1) Vascular endothelial growth factor receptor 1 and 2 (Flt-1 and KDR) Vascular permeability factor receptor vascular endothelial growth factor/vascular permeability factor receptor
Type:
Receptor Tyrosine Kinase
Mol. Mass.:
150800.23
Organism:
Homo sapiens (Human)
Description:
P17948
Residue:
1338
  
Inhibitor
Name:
BDBM107698
Synonyms:
US11426393, Compound Table XV.4 US8722895, 4: [(3-Hydroxy-5-(4-methylphenyl)pyridine-2- carbonyl)amino]-acetic acid USRE47437, Example [(3-Hydroxy-5-(4-methylphenyl)pyridine-2-carbonyl)amino]-acetic acid
Type:
Small organic molecule
Emp. Form.:
C15H14N2O4
Mol. Mass.:
286.2827
SMILES:
Cc1ccc(cc1)-c1cnc(C(=O)NCC(O)=O)c(O)c1
: