Target
Vascular endothelial growth factor receptor 1
Ligand
BDBM107701
Substrate
Meas. Tech.
VEGF ELISA Assay
EC50
7700±n/a nM
Citation
 Kawamoto, RMWu, SEvdokimov, AGGreis, KDBoyer, ASWarshakoon, NC Prolyl hydroxylase inhibitors and methods of use US Patent  US11426393 Publication Date 8/30/2022 
Target
Name:
Vascular endothelial growth factor receptor 1
Synonyms:
FLT FRT Fms-like tyrosine kinase 1 Tyrosine-protein kinase FRT VEGFR-1 VGFR1_HUMAN Vascular endothelial growth factor receptor 1 (FLT1) Vascular endothelial growth factor receptor 1 and 2 (Flt-1 and KDR) Vascular permeability factor receptor vascular endothelial growth factor/vascular permeability factor receptor
Type:
Receptor Tyrosine Kinase
Mol. Mass.:
150800.23
Organism:
Homo sapiens (Human)
Description:
P17948
Residue:
1338
  
Inhibitor
Name:
BDBM107701
Synonyms:
US11426393, Compound Table XV.7 US8722895, 7: {[5-(2-Chloro-phenyl)-3-hydroxy-pyridine- 2-carbonyl]-amino}-acetic acid methyl ester USRE47437, Example {[5-(2-Chloro-phenyl)-3-hydroxy-pyridine-2-carbonyl]-amino}-acetic acid methyl ester
Type:
Small organic molecule
Emp. Form.:
C15H13ClN2O4
Mol. Mass.:
320.728
SMILES:
COC(=O)CNC(=O)c1ncc(cc1O)-c1ccccc1Cl
: