Target
Vascular endothelial growth factor receptor 1
Ligand
BDBM107716
Substrate
Meas. Tech.
VEGF ELISA Assay
EC50
>100000±n/a nM
Citation
 Kawamoto, RMWu, SEvdokimov, AGGreis, KDBoyer, ASWarshakoon, NC Prolyl hydroxylase inhibitors and methods of use US Patent  US11426393 Publication Date 8/30/2022 
Target
Name:
Vascular endothelial growth factor receptor 1
Synonyms:
FLT FRT Fms-like tyrosine kinase 1 Tyrosine-protein kinase FRT VEGFR-1 VGFR1_HUMAN Vascular endothelial growth factor receptor 1 (FLT1) Vascular endothelial growth factor receptor 1 and 2 (Flt-1 and KDR) Vascular permeability factor receptor vascular endothelial growth factor/vascular permeability factor receptor
Type:
Receptor Tyrosine Kinase
Mol. Mass.:
150800.23
Organism:
Homo sapiens (Human)
Description:
P17948
Residue:
1338
  
Inhibitor
Name:
BDBM107716
Synonyms:
US11426393, Compound Table XV.22 US8722895, 22: ({3-Hydroxy-5-[3-(pyrrolidine-1-carbonyl)- phenyl]-pyridine-2-carbonyl}-amino)-acetic acid methyl ester USRE47437, Example ({3-Hydroxy-5-[3-(pyrrolidine-1-carbonyl)-phenyl]-pyridine-2-carbonyl}-amino)-aceticacid methyl ester
Type:
Small organic molecule
Emp. Form.:
C20H21N3O5
Mol. Mass.:
383.3978
SMILES:
COC(=O)CNC(=O)c1ncc(cc1O)-c1cccc(c1)C(=O)N1CCCC1
: