Target
Enoyl-[acyl-carrier-protein] reductase [NADH] FabI
Ligand
BDBM8733
Substrate
Crotonoyl-ACP
Meas. Tech.
Enzyme Inhibition Assay
Temperature
303.15±n/a K
IC50
390±n/a nM
Comments
extracted
Citation
 Seefeld, MAMiller, WHNewlander, KABurgess, WJDeWolf, WEElkins, PAHead, MSJakas, DRJanson, CAKeller, PMManley, PJMoore, TDPayne, DJPearson, SPolizzi, BJQiu, XRittenhouse, SFUzinskas, INWallis, NGHuffman, WF Indole naphthyridinones as inhibitors of bacterial enoyl-ACP reductases FabI and FabK. J Med Chem 46:1627-35 (2003)  
Target
Name:
Enoyl-[acyl-carrier-protein] reductase [NADH] FabI
Synonyms:
Enoyl-ACP Reductase (FabI) NADH-dependent enoyl-ACP reductase fabI
Type:
Enzyme
Mol. Mass.:
28115.25
Organism:
Haemophilus influenzae
Description:
P44432
Residue:
262
  
Inhibitor
Name:
BDBM8733
Synonyms:
(2E)-N-methyl-N-[(1-methyl-1H-indol-3-yl)methyl]-3-(7-oxo-5,6,7,8-tetrahydro-1,8-naphthyridin-3-yl)prop-2-enamide indole naphthyridinone 29
Type:
Small organic molecule
Emp. Form.:
C22H22N4O2
Mol. Mass.:
374.4357
SMILES:
CN(Cc1cn(C)c2ccccc12)C(=O)\C=C\c1cnc2NC(=O)CCc2c1
:
Substrate
Name:
Crotonoyl-ACP
Synonyms:
Type:
Other Protein Type
Mol. Mass.:
358.43
Organism:
Description:
1. NAD(P)H is its co-substrate. 2. Crotonoyl-ACP was synthesized using ACP synthase to catalyse the addition of a crotonoyl group from crotonoyl-CoA to apo-ACP
Residue:
3
NA