Target
Cyclin-K/Cyclin-dependent kinase 12
Ligand
BDBM572094
Substrate
Meas. Tech.
Protein Kinase Assay Condition A (Thiol Containing Conditions)
IC50
<100±n/a nM
Citation
 Kanouni, TArnold, LKaldor, SWMurphy, EA Inhibitors of cyclin-dependent kinases US Patent  US11447493 Publication Date 9/20/2022 
Target
Name:
Cyclin-K/Cyclin-dependent kinase 12
Synonyms:
CDK12/Cyclin K
Type:
Mol. Mass.:
Description:
ASSAY_ID of ChEMBL is 1735959
Components:
This complex has 2 components.
Component 1
Name:
Cyclin-K
Synonyms:
CCNK CPR4
Type:
PROTEIN
Mol. Mass.:
64254.10
Organism:
Homo sapiens (Human)
Description:
ChEMBL_107901
Residue:
580
  
Component 2
Name:
Cyclin-dependent kinase 12
Synonyms:
2.7.11.22 CDC2-related protein kinase 7 CDK12_HUMAN CRKRS Cell division cycle 2-related protein kinase 7 Cyclin-dependent kinase 12 hCDK12
Type:
PROTEIN
Mol. Mass.:
164218.64
Organism:
Homo sapiens
Description:
ChEMBL_117739
Residue:
1490
  
Inhibitor
Name:
BDBM572094
Synonyms:
(R)-N,N-dimethyl-2-((1-(4- propionamidobenzoyl)pyrrolidin-3- yl)amino)quinazoline-7-carboxamide | US11447493, Example 59
Type:
Small organic molecule
Emp. Form.:
C25H28N6O3
Mol. Mass.:
460.5282
SMILES:
CCC(=O)Nc1ccc(cc1)C(=O)N1CC[C@H](C1)Nc1ncc2ccc(cc2n1)C(=O)N(C)C
: