Target
GTPase KRas [G12D]
Ligand
BDBM50579601
Substrate
Meas. Tech.
KRas G12D Binding Assay
IC50
0.400±n/a nM
Target
Name:
GTPase KRas [G12D]
Synonyms:
GTPase KRas (G12D) KRAS2 RASK_HUMAN
Type:
Enzyme Catalytic Domain
Mol. Mass.:
21713.12
Organism:
Homo sapiens (Human)
Description:
P01116[G12D]
Residue:
189
  
Inhibitor
Name:
BDBM50579601
Synonyms:
CHEMBL4858364 US20230279025, Example 481
Type:
Small organic molecule
Emp. Form.:
C33H31F3N6O2
Mol. Mass.:
600.6334
SMILES:
Oc1cc(-c2ncc3c(nc(OC[C@@]45CCCN4C[C@H](F)C5)nc3c2F)N2CC3CCC(C2)N3)c2c(C#C)c(F)ccc2c1
: