Target
Tyrosine-protein kinase receptor TYRO3
Ligand
BDBM308186
Substrate
Meas. Tech.
Activity Assay
IC50
39.0±n/a nM
Citation
 Wang, XZhang, WFrye, S Therapeutic uses of selected pyrimidine compounds with anti-Mer tyrosine kinase activity US Patent  US9649309 Publication Date 5/16/2017 
Target
Name:
Tyrosine-protein kinase receptor TYRO3
Synonyms:
BYK RSE TIF TYRO3_HUMAN | Tyrosine-protein kinase SKY
Type:
Protein
Mol. Mass.:
96894.13
Organism:
Homo sapiens (Human)
Description:
Q06418
Residue:
890
  
Inhibitor
Name:
BDBM308186
Synonyms:
US9649309, Compound UNC2550A
Type:
Small organic molecule
Emp. Form.:
C24H36N6O
Mol. Mass.:
424.5822
SMILES:
CCCCNc1ncc(c(NC2CC[C@H](O)CC2)n1)-c1ccc(CNC2CCC2)cn1
: