Target
Growth arrest-specific protein 6
Ligand
BDBM308186
Substrate
Meas. Tech.
Activity Assay
IC50
13.0±n/a nM
Citation
 Wang, XZhang, WFrye, S Therapeutic uses of selected pyrimidine compounds with anti-Mer tyrosine kinase activity US Patent  US9649309 Publication Date 5/16/2017 
Target
Name:
Growth arrest-specific protein 6
Synonyms:
AXL receptor tyrosine kinase ligand GAS-6 GAS6_HUMAN
Type:
PROTEIN
Mol. Mass.:
74914.43
Organism:
Homo sapiens (Human)
Description:
Q14393
Residue:
678
  
Inhibitor
Name:
BDBM308186
Synonyms:
US9649309, Compound UNC2550A
Type:
Small organic molecule
Emp. Form.:
C24H36N6O
Mol. Mass.:
424.5822
SMILES:
CCCCNc1ncc(c(NC2CC[C@H](O)CC2)n1)-c1ccc(CNC2CCC2)cn1
: