Target
Tyrosine-protein kinase Mer
Ligand
BDBM308266
Substrate
Meas. Tech.
Activity Assay
IC50
8.80±n/a nM
Citation
 Wang, XZhang, WFrye, S Therapeutic uses of selected pyrimidine compounds with anti-Mer tyrosine kinase activity US Patent  US9649309 Publication Date 5/16/2017 
Target
Name:
Tyrosine-protein kinase Mer
Synonyms:
MER MERTK Proto-oncogene c-Mer Receptor tyrosine kinase MerTK | Tyrosine-protein kinase Mer
Type:
PROTEIN
Mol. Mass.:
110234.77
Organism:
Homo sapiens (Human)
Description:
ChEMBL_1498723
Residue:
999
  
Inhibitor
Name:
BDBM308266
Synonyms:
US9649309, Compound UNC3071A
Type:
Small organic molecule
Emp. Form.:
C27H42N8O3
Mol. Mass.:
526.6742
SMILES:
CCCCNc1ncc(c(N[C@H]2CC[C@H](O)CC2)n1)-c1ccc(nn1)N1CCN(CC1)C(=O)OC(C)(C)C
: