Target
Membrane primary amine oxidase
Ligand
BDBM581414
Substrate
Meas. Tech.
Enzyme Activity Assay:
IC50
0.400±n/a nM
Citation
 Luo, ZLi, XYang, YYang, LLi, PHe, HLi, JChen, S SSAO inhibitor US Patent  US11505532 Publication Date 11/22/2022 
Target
Name:
Membrane primary amine oxidase
Synonyms:
AOC3 Amine oxidase, copper containing Semicarbazide-sensitive amine oxidase/ Vascular adhesion protein 1 (SSAO/VAP-1) Vascular adhesion protein 1 (VAP-1)
Type:
Protein
Mol. Mass.:
84620.86
Organism:
Homo sapiens (Human)
Description:
Q16853
Residue:
763
  
Inhibitor
Name:
BDBM581414
Synonyms:
US11505532, Compound WX083
Type:
Small organic molecule
Emp. Form.:
C15H18ClFN4O2
Mol. Mass.:
340.78
SMILES:
NC\C(COc1ccc(cc1)-c1n[nH]c(n1)C(CO)CCl)=C/F
: