Target
Lysine-specific histone demethylase 1A
Ligand
BDBM581931
Substrate
Meas. Tech.
Inhibitory Activity (In Vitro)
IC50
0.093±n/a nM
Citation
 Osada, A Anti-tumor effect potentiator using novel biphenyl compound US Patent  US11510915 Publication Date 11/29/2022 
Target
Name:
Lysine-specific histone demethylase 1A
Synonyms:
AOF2 Flavin-containing amine oxidase domain-containing protein 2 KDM1A KIAA0601 Lysine-specific demethylase 1 (LSD1) Lysine-specific histone demethylase 1 (LSD1)
Type:
Enzyme
Mol. Mass.:
92901.01
Organism:
Homo sapiens (Human)
Description:
O60341
Residue:
852
  
Inhibitor
Name:
BDBM581931
Synonyms:
US11510915, Example 286
Type:
Small organic molecule
Emp. Form.:
C31H29ClF2N6O
Mol. Mass.:
575.051
SMILES:
N[C@H]1C[C@H]2CC[C@@H]1N2Cc1ccc(-c2cc3nnn(CC4(O)CCC4)c3c(Cl)c2F)c(c1)-c1ccc(C#N)c(F)c1
: