Target
Lysine-specific histone demethylase 1A
Ligand
BDBM581938
Substrate
Meas. Tech.
Inhibitory Activity (In Vitro)
IC50
0.076±n/a nM
Citation
 Osada, A Anti-tumor effect potentiator using novel biphenyl compound US Patent  US11510915 Publication Date 11/29/2022 
Target
Name:
Lysine-specific histone demethylase 1A
Synonyms:
AOF2 Flavin-containing amine oxidase domain-containing protein 2 KDM1A KIAA0601 Lysine-specific demethylase 1 (LSD1) Lysine-specific histone demethylase 1 (LSD1)
Type:
Enzyme
Mol. Mass.:
92901.01
Organism:
Homo sapiens (Human)
Description:
O60341
Residue:
852
  
Inhibitor
Name:
BDBM581938
Synonyms:
US11510915, Example 293
Type:
Small organic molecule
Emp. Form.:
C32H33F3N6O
Mol. Mass.:
574.6392
SMILES:
CCC(O)(CC)Cn1nnc2cc(c(F)c(F)c12)-c1ccc(CN2[C@@H]3CC[C@H]2[C@@H](N)C3)cc1-c1ccc(C#N)c(F)c1
: