Target
Ubiquitin carboxyl-terminal hydrolase 7
Ligand
BDBM581906
Substrate
Meas. Tech.
USP7 assay
IC50
<20±n/a nM
Citation
 Sara, BXiaoxi, LSara, BXiaoxi, L INHIBITORS TARGETING UBIQUITIN SPECIFIC PROTEASE 7 (USP7) WIPO 0:0 (2023) Target
Name:
Ubiquitin carboxyl-terminal hydrolase 7
Synonyms:
Deubiquitinating enzyme 7 Herpesvirus-associated ubiquitin-specific protease USP7 Ubiquitin-specific-processing protease 7
Type:
PROTEIN
Mol. Mass.:
128274.45
Organism:
Homo sapiens (Human)
Description:
ChEMBL_1469483
Residue:
1102
  
Inhibitor
Name:
BDBM581906
Synonyms:
WO2023003973, Compound 93
Type:
Small organic molecule
Emp. Form.:
C42H52N8O6S
Mol. Mass.:
796.977
SMILES:
CN1CCN(CCC(=O)Nc2ccc3c(c2)ncn(CC2(O)CCN(CC2)C(=O)C2CCN(C[C@H]2c2ccccc2)c2ccccc2NS(=O)(=O)C=C)c3=O)CC1
: