Target
Ubiquitin carboxyl-terminal hydrolase 7
Ligand
BDBM581907
Substrate
Meas. Tech.
USP7 assay
IC50
<20±n/a nM
Citation
 Sara, BXiaoxi, LSara, BXiaoxi, L INHIBITORS TARGETING UBIQUITIN SPECIFIC PROTEASE 7 (USP7) WIPO 0:0 (2023) Target
Name:
Ubiquitin carboxyl-terminal hydrolase 7
Synonyms:
Deubiquitinating enzyme 7 Herpesvirus-associated ubiquitin-specific protease USP7 Ubiquitin-specific-processing protease 7
Type:
PROTEIN
Mol. Mass.:
128274.45
Organism:
Homo sapiens (Human)
Description:
ChEMBL_1469483
Residue:
1102
  
Inhibitor
Name:
BDBM581907
Synonyms:
WO2023003973, Compound 106
Type:
Small organic molecule
Emp. Form.:
C42H51N9O5
Mol. Mass.:
761.9116
SMILES:
CN1CCN(CCC(=O)Nc2ccc3c(c2)ncn(CC2(O)CCN(CC2)C(=O)C2CCN(CC2c2ccccc2)c2cnccc2NC(=O)C=C)c3=O)CC1
: