Target
Ubiquitin carboxyl-terminal hydrolase 7
Ligand
BDBM581909
Substrate
Meas. Tech.
USP7 assay
IC50
<20±n/a nM
Citation
 Sara, BXiaoxi, LSara, BXiaoxi, L INHIBITORS TARGETING UBIQUITIN SPECIFIC PROTEASE 7 (USP7) WIPO 0:0 (2023) Target
Name:
Ubiquitin carboxyl-terminal hydrolase 7
Synonyms:
Deubiquitinating enzyme 7 Herpesvirus-associated ubiquitin-specific protease USP7 Ubiquitin-specific-processing protease 7
Type:
PROTEIN
Mol. Mass.:
128274.45
Organism:
Homo sapiens (Human)
Description:
ChEMBL_1469483
Residue:
1102
  
Inhibitor
Name:
BDBM581909
Synonyms:
WO2023003973, Compound 109
Type:
Small organic molecule
Emp. Form.:
C44H51FN8O5
Mol. Mass.:
790.9247
SMILES:
OC1(Cn2cnc3cc(OCCN4CCNCC4)ccc3c2=O)CCN(CC1)C(=O)C1CCN(CCNC(=O)c2ccc3c(F)ccnc3c2)CC1c1ccccc1
: