Target
Ubiquitin carboxyl-terminal hydrolase 7
Ligand
BDBM581911
Substrate
Meas. Tech.
USP7 assay
IC50
<20±n/a nM
Citation
 Sara, BXiaoxi, LSara, BXiaoxi, L INHIBITORS TARGETING UBIQUITIN SPECIFIC PROTEASE 7 (USP7) WIPO 0:0 (2023) Target
Name:
Ubiquitin carboxyl-terminal hydrolase 7
Synonyms:
Deubiquitinating enzyme 7 Herpesvirus-associated ubiquitin-specific protease USP7 Ubiquitin-specific-processing protease 7
Type:
PROTEIN
Mol. Mass.:
128274.45
Organism:
Homo sapiens (Human)
Description:
ChEMBL_1469483
Residue:
1102
  
Inhibitor
Name:
BDBM581911
Synonyms:
WO2023003973, Compound 116
Type:
Small organic molecule
Emp. Form.:
C44H51ClN6O5
Mol. Mass.:
779.366
SMILES:
CN(C)CCCOc1ccc2c(c1)ncn(CC1(O)CCN(CC1)C(=O)C(CCCNC(=O)c1ccc3c(Cl)cc(nc3c1)C1CC1)Cc1ccccc1)c2=O
: