Target
Ubiquitin carboxyl-terminal hydrolase 7
Ligand
BDBM581912
Substrate
Meas. Tech.
USP7 assay
IC50
<20±n/a nM
Citation
 Sara, BXiaoxi, LSara, BXiaoxi, L INHIBITORS TARGETING UBIQUITIN SPECIFIC PROTEASE 7 (USP7) WIPO 0:0 (2023) Target
Name:
Ubiquitin carboxyl-terminal hydrolase 7
Synonyms:
Deubiquitinating enzyme 7 Herpesvirus-associated ubiquitin-specific protease USP7 Ubiquitin-specific-processing protease 7
Type:
PROTEIN
Mol. Mass.:
128274.45
Organism:
Homo sapiens (Human)
Description:
ChEMBL_1469483
Residue:
1102
  
Inhibitor
Name:
BDBM581912
Synonyms:
WO2023003973, Compound 119
Type:
Small organic molecule
Emp. Form.:
C44H52ClN7O5
Mol. Mass.:
794.381
SMILES:
CC(C)c1cnc2cc(ccc2c1Cl)C(=O)NCCC[C@H](Cc1ccccc1)C(=O)N1CCC(O)(Cn2cnc3cc(NC(=O)CCN(C)C)ccc3c2=O)CC1
: