Target
Ubiquitin carboxyl-terminal hydrolase 7
Ligand
BDBM581918
Substrate
Meas. Tech.
USP7 assay
IC50
<20±n/a nM
Citation
 Sara, BXiaoxi, LSara, BXiaoxi, L INHIBITORS TARGETING UBIQUITIN SPECIFIC PROTEASE 7 (USP7) WIPO 0:0 (2023) Target
Name:
Ubiquitin carboxyl-terminal hydrolase 7
Synonyms:
Deubiquitinating enzyme 7 Herpesvirus-associated ubiquitin-specific protease USP7 Ubiquitin-specific-processing protease 7
Type:
PROTEIN
Mol. Mass.:
128274.45
Organism:
Homo sapiens (Human)
Description:
ChEMBL_1469483
Residue:
1102
  
Inhibitor
Name:
BDBM581918
Synonyms:
WO2023003973, Compound Table2.3
Type:
Small organic molecule
Emp. Form.:
C48H57ClN8O5
Mol. Mass.:
861.47
SMILES:
CN1CCN(CCC(=O)Nc2ccc3c(c2)ncn(CC2(O)CCN(CC2)C(=O)[C@@H](CCCNC(=O)c2ccc4c(Cl)c5CCCCc5nc4c2)Cc2ccccc2)c3=O)CC1
: