Target
ADP-ribosyl cyclase/cyclic ADP-ribose hydrolase 1
Ligand
BDBM588014
Substrate
Meas. Tech.
Enzyme Assay
IC50
<10±n/a nM
Citation
 Schenkel, LBVasbinder, MMKuntz, KWPerl, NRDowning, J Heterobicyclic amides as inhibitors of CD38 US Patent  US11535621 Publication Date 12/27/2022 
Target
Name:
ADP-ribosyl cyclase/cyclic ADP-ribose hydrolase 1
Synonyms:
CD38 Lymphocyte differentiation antigen CD38
Type:
PROTEIN
Mol. Mass.:
34333.62
Organism:
Homo sapiens (Human)
Description:
ChEMBL_1509931
Residue:
300
  
Inhibitor
Name:
BDBM588014
Synonyms:
US11535621, Example 263
Type:
Small organic molecule
Emp. Form.:
C20H22N4O2S
Mol. Mass.:
382.479
SMILES:
OC1(CC1)[C@H]1CC[C@@H](CC1)NC(=O)c1nc(cc2ccsc12)-n1ccnc1
: