Target
Receptor-type tyrosine-protein kinase FLT3 [D835Y]
Ligand
BDBM538618
Substrate
Meas. Tech.
IC50 Kinase Assays
IC50
<0.508±n/a nM
Citation
 Starczynowski, DTThomas, CJRhyasen, GMelgar, KWalker, MMJiang, J Substituted Imidazo[1,2-a]-pyridines as IRAK 1/4 and FLT3 inhibitors US Patent  US11542261 Publication Date 1/3/2023 
Target
Name:
Receptor-type tyrosine-protein kinase FLT3 [D835Y]
Synonyms:
CD135 FLK2 FLT3(D835Y) Receptor-type tyrosine-protein kinase FLT3 (D835Y) STK1 Tyrosine Kinase FLT3 Mutant (D835Y)
Type:
Mol. Mass.:
112937.71
Organism:
Homo sapiens (Human)
Description:
P36888 D835Y
Residue:
993
  
Inhibitor
Name:
BDBM538618
Synonyms:
NCGC 00262327 US11542261, Compound I-20
Type:
Small organic molecule
Emp. Form.:
C20H21N7O
Mol. Mass.:
375.427
SMILES:
COc1cc2ncc(-c3cccc(NC4CCNC4)n3)n2cc1-c1cn[nH]c1
: