Target
Receptor-type tyrosine-protein kinase FLT3 [D835Y]
Ligand
BDBM50300690
Substrate
Meas. Tech.
IC50 Kinase Assays
IC50
0.002±n/a nM
Citation
 Starczynowski, DTThomas, CJRhyasen, GMelgar, KWalker, MMJiang, J Substituted Imidazo[1,2-a]-pyridines as IRAK 1/4 and FLT3 inhibitors US Patent  US11542261 Publication Date 1/3/2023 
Target
Name:
Receptor-type tyrosine-protein kinase FLT3 [D835Y]
Synonyms:
CD135 FLK2 FLT3(D835Y) Receptor-type tyrosine-protein kinase FLT3 (D835Y) STK1 Tyrosine Kinase FLT3 Mutant (D835Y)
Type:
Mol. Mass.:
112937.71
Organism:
Homo sapiens (Human)
Description:
P36888 D835Y
Residue:
993
  
Inhibitor
Name:
BDBM50300690
Synonyms:
1-(5-Tert-Butyl-1,2-Oxazol-3-Yl)-3-(4-{7-[2-(Morpholin-4-Yl)ethoxy]imidazo[2,1-B][1,3]benzothiazol-2-Yl}phenyl)urea AC 220 AC010220 ASP-2689 N-(5-tert-Butyl-isoxazol-3-yl)-N'-{4-[7-(2-morpholin-4-yl-ethoxy)imidazo[2,1-b][1,3]benzothiazol-2-yl]phenyl}urea Quizartinib (AC220) US11542261, Compound quizartinib | US9216997, Quizartinib (positive compound)
Type:
Small organic molecule
Emp. Form.:
C29H32N6O4S
Mol. Mass.:
560.667
SMILES:
CC(C)(C)c1cc(NC(=O)Nc2ccc(cc2)-c2cn3c(n2)sc2cc(OCCN4CCOCC4)ccc32)no1
: