Target
Neprilysin/Angiotensin-converting enzyme
Ligand
BDBM582844
Substrate
Meas. Tech.
Enzyme Inhibition Assay
Ki
1.000±n/a nM
Citation
 Hughes, ADFenster, EFleury, MGendron, RMoran, EJ Neprilysin inhibitors US Patent  US11547687 Publication Date 1/10/2023 
Target
Name:
Neprilysin/Angiotensin-converting enzyme
Synonyms:
Type:
Protein
Mol. Mass.:
Description:
Components:
This complex has 2 components.
Component 1
Name:
Neprilysin
Synonyms:
Atriopeptidase CD_antigen=CD10 EPN MME NEP_HUMAN Neutral endopeptidase | Neutral endopeptidase 24.11
Type:
Enzyme
Mol. Mass.:
85505.38
Organism:
Homo sapiens (Human)
Description:
P08473
Residue:
750
  
Component 2
Name:
Angiotensin-converting enzyme
Synonyms:
ACE Angiotensin converting enzyme (ACE) Angiotensin-converting enzyme, soluble form CD_antigen=CD143 DCP1 Kininase II
Type:
Enzyme
Mol. Mass.:
149709.01
Organism:
Homo sapiens (Human)
Description:
Residue:
1306
  
Inhibitor
Name:
BDBM582844
Synonyms:
US11547687, Comparative Compound G | US20230285340, Comparative Compound G
Type:
Small organic molecule
Emp. Form.:
C22H25NO6
Mol. Mass.:
399.437
SMILES:
OC[C@H](C[C@@H](Cc1ccc(cc1)-c1ccccc1)NC(=O)CCC(O)=O)C(O)=O
: