Target
Transporter
Ligand
BDBM364427
Substrate
Meas. Tech.
Norepinephrine Transporter Binding Assay
Ki
>0.000±n/a nM
Citation
 Newman, AHOkunola-Bakare, OMCao, J Potent and selective inhibitors of monoamine transporters; method of making; and use thereof US Patent  US11555013 Publication Date 1/17/2023 
Target
Name:
Transporter
Synonyms:
NE transporter Norepinephrine transporter(NET)
Type:
Multi-pass membrane protein
Mol. Mass.:
69236.90
Organism:
Rattus norvegicus (rat)
Description:
Q63380
Residue:
617
  
Inhibitor
Name:
BDBM364427
Synonyms:
US10913711, Compound 10a US9862679, Compound 10a
Type:
Small organic molecule
Emp. Form.:
C22H30N2O2S
Mol. Mass.:
386.551
SMILES:
CC(O)CN1CCN(CCS(=O)C(c2ccccc2)c2ccccc2)CC1
: