Target
Bromodomain-containing protein 9 [133-239]
Ligand
BDBM565352
Substrate
Meas. Tech.
BRD9 bromodomain TR-FRET Competition Binding Assay
IC50
<10±n/a nM
Citation
 Ruppel, SKYang, ZLowe, JTVoigt, JHNetherton, M Compounds and uses thereof US Patent  US11560381 Publication Date 1/24/2023 
Target
Name:
Bromodomain-containing protein 9 [133-239]
Synonyms:
BRD9 Bromodomain-containing protein 9 (BRD9)(133-239)
Type:
Enzyme Catalytic Domain
Mol. Mass.:
12383.34
Organism:
Homo sapiens (Human)
Description:
aa 133-239
Residue:
107
  
Inhibitor
Name:
BDBM565352
Synonyms:
US11414416, Compound D119 | US11560381, Compound D119
Type:
Small organic molecule
Emp. Form.:
C43H46N6O10
Mol. Mass.:
806.8595
SMILES:
COc1cc(cc(OC)c1CN1CCC2(CN(C2)C(=O)CCOCCOc2ccc3C(=O)N(C4CCC(=O)NC4=O)C(=O)c3c2)CC1)-c1cn(C)c(=O)c2cnccc12
: