Target
DNA-directed RNA polymerase subunit beta
Ligand
BDBM592167
Substrate
Meas. Tech.
Inhibition Assay
IC50
1500±n/a nM
Citation
 Ebright, RHEbright, YWFreundlich, JSGallardo-Macias, RLi, S Antibacterial agents: arylalkylcarboxamido phloroglucinols US Patent  US11572337 Publication Date 2/7/2023 
Target
Name:
DNA-directed RNA polymerase subunit beta
Synonyms:
Bacterial DNA-directed RNA polymerase DNA-directed RNA polymerase subunit beta RNA polymerase subunit beta (β-RNAP) RPOB_ECOLI groN rif rpoB stv | tabD
Type:
Enzyme
Mol. Mass.:
150595.80
Organism:
Escherichia coli
Description:
P0A8V2
Residue:
1342
  
Inhibitor
Name:
BDBM592167
Synonyms:
US11572337, Compound 0MTK261
Type:
Small organic molecule
Emp. Form.:
C25H26N2O6
Mol. Mass.:
450.4837
SMILES:
Oc1cc(O)c(C(=O)NCCc2ccc(Oc3ccc(cc3)N3CCOCC3)cc2)c(O)c1
: