Target
Myosin light chain kinase, smooth muscle
Ligand
BDBM307638
Substrate
Meas. Tech.
MYLK/MLCK Assay
Ki
600±n/a nM
Citation
 Brown, SD ASK1 inhibitor compounds and uses thereof US Patent  US10150755 Publication Date 12/11/2018 
Target
Name:
Myosin light chain kinase, smooth muscle
Synonyms:
KRP MLCK MYLK MYLK_HUMAN Telokin | smMLCK
Type:
Protein
Mol. Mass.:
210702.56
Organism:
Homo sapiens (Human)
Description:
Q15746
Residue:
1914
  
Inhibitor
Name:
BDBM307638
Synonyms:
2-(6-(4-cyclopropyl- 4H-1,2,4-triazol-3- yl)pyridin-2-yl)-5- (1-methyl-1H- imidazol-4- yl)isoindolin-1-one | US10150755, Compound 30
Type:
Small organic molecule
Emp. Form.:
C22H19N7O
Mol. Mass.:
397.4326
SMILES:
Cn1cnc(c1)-c1ccc2C(=O)N(Cc2c1)c1cccc(n1)-c1nncn1C1CC1
: