Target
Isocitrate dehydrogenase [NADP] cytoplasmic [R132C]
Ligand
BDBM404661
Substrate
Meas. Tech.
Biochemical Assay
IC50
15.0±n/a nM
Citation
 Kelly, PFCollis, ADavis, JWalker, DAshwell, SThomson, BLu, W Inhibiting mutant IDH-1 US Patent  US11576906 Publication Date 2/14/2023 
Target
Name:
Isocitrate dehydrogenase [NADP] cytoplasmic [R132C]
Synonyms:
IDH1 IDH1(R132C) Isocitrate dehydrogenase (IDH1)(R132C) Isocitrate dehydrogenase [NADP] cytoplasmic (IDH1) (R132C) | PICD
Type:
Enzyme Catalytic Domain
Mol. Mass.:
46607.23
Organism:
Homo sapiens (Human)
Description:
O75874[R132C]
Residue:
414
  
Inhibitor
Name:
BDBM404661
Synonyms:
US10344004, Test compound Table 3 US11311527, Cpd ID Bay 1436032 US11576906, Compound Bay143603-2
Type:
Small organic molecule
Emp. Form.:
C26H30F3N3O3
Mol. Mass.:
489.5299
SMILES:
C[C@H]1C[C@H](CC(C)(C)C1)n1c(Nc2ccc(OC(F)(F)F)cc2)nc2cc(CCC(O)=O)ccc12
: