Target
Transient receptor potential cation channel subfamily A member 1
Ligand
BDBM593698
Substrate
Meas. Tech.
Filpr Assay
IC50
16.0±n/a nM
Citation
 Fleck, MTBinder, FPDahmann, GHehn, JPHeimann, ACLessel, UFWillwacher, J Thienopyrimidones US Patent  US11578080 Publication Date 2/14/2023 
Target
Name:
Transient receptor potential cation channel subfamily A member 1
Synonyms:
ANKTM1 TRPA1 Transformation-sensitive protein p120 | Transient receptor potential cation channel subfamily A member 1 (TRPA1)
Type:
Protein
Mol. Mass.:
127514.20
Organism:
Homo sapiens (Human)
Description:
O75762
Residue:
1119
  
Inhibitor
Name:
BDBM593698
Synonyms:
US11578080, Example 7
Type:
Small organic molecule
Emp. Form.:
C20H18ClN7O3S
Mol. Mass.:
471.92
SMILES:
CN1CCc2c(sc3ncn(Cc4nnn(C[C@H](O)c5ccc(Cl)cc5)n4)c(=O)c23)C1=O
: