Target
Transient receptor potential cation channel subfamily A member 1
Ligand
BDBM593714
Substrate
Meas. Tech.
Filpr Assay
IC50
14.0±n/a nM
Citation
 Fleck, MTBinder, FPDahmann, GHehn, JPHeimann, ACLessel, UFWillwacher, J Thienopyrimidones US Patent  US11578080 Publication Date 2/14/2023 
Target
Name:
Transient receptor potential cation channel subfamily A member 1
Synonyms:
ANKTM1 TRPA1 Transformation-sensitive protein p120 | Transient receptor potential cation channel subfamily A member 1 (TRPA1)
Type:
Protein
Mol. Mass.:
127514.20
Organism:
Homo sapiens (Human)
Description:
O75762
Residue:
1119
  
Inhibitor
Name:
BDBM593714
Synonyms:
US11578080, Example 20
Type:
Small organic molecule
Emp. Form.:
C20H19N7O3S
Mol. Mass.:
437.475
SMILES:
Cc1ccc(cc1)[C@@H](O)Cn1nnc(Cn2cnc3sc4c(CCNC4=O)c3c2=O)n1
: