Target
Transient receptor potential cation channel subfamily A member 1
Ligand
BDBM593716
Substrate
Meas. Tech.
Filpr Assay
IC50
7.00±n/a nM
Citation
 Fleck, MTBinder, FPDahmann, GHehn, JPHeimann, ACLessel, UFWillwacher, J Thienopyrimidones US Patent  US11578080 Publication Date 2/14/2023 
Target
Name:
Transient receptor potential cation channel subfamily A member 1
Synonyms:
ANKTM1 TRPA1 Transformation-sensitive protein p120 | Transient receptor potential cation channel subfamily A member 1 (TRPA1)
Type:
Protein
Mol. Mass.:
127514.20
Organism:
Homo sapiens (Human)
Description:
O75762
Residue:
1119
  
Inhibitor
Name:
BDBM593716
Synonyms:
US11578080, Example 22
Type:
Small organic molecule
Emp. Form.:
C20H17N7O3S2
Mol. Mass.:
467.524
SMILES:
Cc1c(sc2ncn(Cc3nnn(C[C@H](O)c4cc5ccccc5s4)n3)c(=O)c12)C(N)=O
: